Target
Cyclin-dependent kinase 2/G1/S-specific cyclin-E1
Ligand
BDBM8057
Substrate
Histone H1
Meas. Tech.
CDK Kinase Inhibition Assay
Temperature
303.15±n/a K
Ki
>20000±n/a nM
Comments
extracted
Citation
 Wang, SMeades, CWood, GOsnowski, AAnderson, SYuill, RThomas, MMezna, MJackson, WMidgley, CGriffiths, GFleming, IGreen, SMcNae, IWu, SYMcInnes, CZheleva, DWalkinshaw, MDFischer, PM 2-Anilino-4-(thiazol-5-yl)pyrimidine CDK inhibitors: synthesis, SAR analysis, X-ray crystallography, and biological activity. J Med Chem 47:1662-75 (2004)  
Target
Name:
Cyclin-dependent kinase 2/G1/S-specific cyclin-E1
Synonyms:
CDK2/CycE CDK2/E Cyclin-Dependent Kinase 2 (CDK2) Cyclin-dependent kinase 2/cyclin E1
Type:
Protein
Mol. Mass.:
Description:
Components:
This complex has 2 components.
Component 1
Name:
Cyclin-dependent kinase 2
Synonyms:
CDK2 CDK2_HUMAN Cell division protein kinase 2 Protein cereblon/Cyclin-dependent kinase 2 | p33 protein kinase
Type:
Enzyme Subunit
Mol. Mass.:
33938.17
Organism:
Homo sapiens (Human)
Description:
P24941
Residue:
298
  
Component 2
Name:
G1/S-specific cyclin-E1
Synonyms:
CCNE CCNE1_HUMAN
Type:
Enzyme Subunit
Mol. Mass.:
47073.17
Organism:
Homo sapiens (Human)
Description:
Residue:
410
  
Inhibitor
Name:
BDBM8057
Synonyms:
2-Anilino-4-(thiazol-5-yl)pyrimidine deriv. 28 [4-(2,4-Dimethylthiazol-5-yl)-pyrimidin-2-yl]methyl-(3-nitrophenyl)amine
Type:
Small organic molecule
Emp. Form.:
C16H15N5O2S
Mol. Mass.:
341.388
SMILES:
CN(c1cccc(c1)N(=O)=O)c1nccc(n1)-c1sc(C)nc1C
:
Substrate
Name:
Histone H1
Synonyms:
Type:
Other Protein Type
Mol. Mass.:
358.43
Organism:
Bos taurus (bovine)
Description:
Residue:
3
NA