Target
Acetylcholinesterase
Ligand
BDBM10512
Substrate
BDBM8959
Meas. Tech.
Enzyme Inhibition Assay
pH
8±n/a
Temperature
310.15±n/a K
Ki
155±46 nM
IC50
0.253±0.016 nM
Citation
 Rosini, MAndrisano, VBartolini, MBolognesi, MLHrelia, PMinarini, ATarozzi, AMelchiorre, C Rational approach to discover multipotent anti-Alzheimer drugs. J Med Chem 48:360-3 (2005)  
Target
Name:
Acetylcholinesterase
Synonyms:
ACES_HUMAN Acetylcholinesterase (AChE) | Acetylcholinesterase (human AChE)
Type:
Enzyme
Mol. Mass.:
67792.70
Organism:
Homo sapiens (Human)
Description:
P22303
Residue:
614
  
Inhibitor
Name:
BDBM10512
Synonyms:
CHEMBL194823 tacrine-lipoic acid hybrid 7
Type:
Small organic molecule
Emp. Form.:
C24H32ClN3OS2
Mol. Mass.:
478.113
SMILES:
Clc1ccc2c(NCCCNC(=O)CCCCC3CCSS3)c3CCCCc3nc2c1
:
Substrate
Name:
BDBM8959
Synonyms:
(2-Mercaptoethyl)trimethylammonium iodide acetate Acetylthiocholine acetylthiocholine chloride | acetylthiocholine iodide
Type:
Small organic molecule
Emp. Form.:
C7H16NOS
Mol. Mass.:
162.272
SMILES:
CC(=O)SCC[N+](C)(C)C
: