Target
Methionine aminopeptidase 2
Ligand
BDBM17468
Substrate
BDBM17353
Meas. Tech.
Enzyme Inhibition Assay
pH
7.5±n/a
Temperature
295.15±n/a K
Ki
1±n/a nM
Citation
 Kallander, LSLu, QChen, WTomaszek, TYang, GTew, DMeek, TDHofmann, GASchulz-Pritchard, CKSmith, WWJanson, CARyan, MDZhang, GFJohanson, KOKirkpatrick, RBHo, TFFisher, PWMattern, MRJohnson, RKHansbury, MJWinkler, JDWard, KWVeber, DFThompson, SK 4-Aryl-1,2,3-triazole: a novel template for a reversible methionine aminopeptidase 2 inhibitor, optimized to inhibit angiogenesis in vivo. J Med Chem 48:5644-7 (2005)  
Target
Name:
Methionine aminopeptidase 2
Synonyms:
Initiation factor 2-associated 67 kDa glycoprotein MAP2_HUMAN MNPEP Methionine aminopeptidase 2 (MetAP2) P67EIF2 p67
Type:
Enzyme
Mol. Mass.:
52884.45
Organism:
Homo sapiens (Human)
Description:
P50579
Residue:
478
  
Inhibitor
Name:
BDBM17468
Synonyms:
1,2,3-triazole analogue, 24 | 5-(3,4-dibromophenyl)-1H-1,2,3-triazole
Type:
Small organic molecule
Emp. Form.:
C8H5Br2N3
Mol. Mass.:
302.953
SMILES:
Brc1ccc(cc1Br)-c1c[nH]nn1
:
Substrate
Name:
BDBM17353
Synonyms:
(2S)-2-amino-N-(4-methyl-2-oxo-2H-chromen-7-yl)-4-(methylsulfanyl)butanamide Met-AMC
Type:
Small organic molecule
Emp. Form.:
C15H18N2O3S
Mol. Mass.:
306.38
SMILES:
CSCC[C@H](N)C(=O)Nc1ccc2c(C)cc(=O)oc2c1
: