Target
Transient receptor potential cation channel subfamily V member 1
Ligand
BDBM20387
Substrate
BDBM10852
Meas. Tech.
Ca2+ Influx Functional Assay for the Determination of in Vitro Activity.
pH
7.4±n/a
Temperature
295.15±n/a K
EC50
147±21 nM
Citation
 Gomtsyan, ABayburt, EKKeddy, RTurner, SCJinkerson, TKDidomenico, SPerner, RJKoenig, JRDrizin, IMcDonald, HASurowy, CSHonore, PMikusa, JMarsh, KCWetter, JMFaltynek, CRLee, CH Alpha-methylation at benzylic fragment of N-aryl-N'-benzyl ureas provides TRPV1 antagonists with better pharmacokinetic properties and higher efficacy in inflammatory pain model. Bioorg Med Chem Lett 17:3894-9 (2007)  
Target
Name:
Transient receptor potential cation channel subfamily V member 1
Synonyms:
Capsaicin receptor Osm-9-like TRP channel 1 TRPV1_HUMAN Transient receptor potential cation channel subfamily V member 1 (TRPV1) Transient receptor potential cation channel subfamily V member 1(TRPV1) Vanilloid VR1 Vanilloid receptor 1 Vanilloid receptor 1 (VRI/TRPV1)
Type:
Protein
Mol. Mass.:
94960.75
Organism:
Homo sapiens (Human)
Description:
Q8NER1
Residue:
839
  
Inhibitor
Name:
BDBM20387
Synonyms:
3-isoquinolin-5-yl-1-{phenyl[4-(trifluoromethyl)phenyl]methyl}urea | isoquinoline antagonist, 5e
Type:
Small organic molecule
Emp. Form.:
C24H18F3N3O
Mol. Mass.:
421.4144
SMILES:
FC(F)(F)c1ccc(cc1)C(NC(=O)Nc1cccc2cnccc12)c1ccccc1
:
Substrate