Target
Clan CD, family C13, asparaginyl endopeptidase-like cysteine peptidase
Ligand
BDBM22125
Substrate
BDBM22115
Meas. Tech.
AE Enzyme Inhibition Assay
Temperature
298.15±n/a K
IC50
0.55±n/a nM
Comments
extracted
Citation
 Götz, MGJames, KEHansell, EDvorák, JSeshaadri, ASojka, DKopácek, PMcKerrow, JHCaffrey, CRPowers, JC Aza-peptidyl Michael Acceptors. A New Class of Potent and Selective Inhibitors of Asparaginyl Endopeptidases (Legumains) from Evolutionarily Diverse Pathogens. J Med Chem 51:2816-32 (2008)  
Target
Name:
Clan CD, family C13, asparaginyl endopeptidase-like cysteine peptidase
Synonyms:
Asparaginyl Endopeptidase (AE) | Clan CD, family C13, asparaginyl endopeptidase-like cysteine peptidase
Type:
Enzyme
Mol. Mass.:
42906.95
Organism:
Trichomonas vaginalis G3
Description:
A2DYT2
Residue:
388
  
Inhibitor
Name:
BDBM22125
Synonyms:
aza-peptide Michael acceptor, 5i | benzyl N-[(1S)-1-{[(2S)-1-[(2E)-N-benzyl-3-[N-(carbamoylmethyl)hydrazido]-N-methylprop-2-enamide]-1-oxopropan-2-yl]carbamoyl}ethyl]carbamate
Type:
Small organic molecule
Emp. Form.:
C28H34N6O7
Mol. Mass.:
566.6056
SMILES:
C[C@H](NC(=O)OCc1ccccc1)C(=O)N[C@@H](C)C(=O)NN(CC(N)=O)C(=O)C=CC(=O)N(C)Cc1ccccc1
:
Substrate
Name:
BDBM22115
Synonyms:
Cbz-Ala-Ala-Asn-AMC
Type:
Fluorogenic substrate
Emp. Form.:
Mol. Mass.:
SMILES:
: