Target
Aurora kinase A
Ligand
BDBM25677
Substrate
CHOCKtide
Meas. Tech.
Aurora Kinase SPA Assay
pH
7±n/a
Temperature
295.15±n/a K
IC50
9200±n/a nM
Citation
 Andersen, CBWan, YChang, JWRiggs, BLee, CLiu, YSessa, FVilla, FKwiatkowski, NSuzuki, MNallan, LHeald, RMusacchio, AGray, NS Discovery of selective aminothiazole aurora kinase inhibitors. ACS Chem Biol 3:180-92 (2008)  
Target
Name:
Aurora kinase A
Synonyms:
AIK ARK-1 AURA AURKA_HUMAN Aurora 2 Aurora kinase A (AURKA) Aurora kinase A (Aurora-2) Aurora/IPL1-related kinase 1 Breast tumor-amplified kinase IAK1 STK15 GN Serine/threonine kinase 15 Serine/threonine-protein kinase 6 Serine/threonine-protein kinase aurora-A aurora-2 | hARK1
Type:
Serine/threonine-protein kinase
Mol. Mass.:
45830.98
Organism:
Homo sapiens (Human)
Description:
O14965
Residue:
403
  
Inhibitor
Name:
BDBM25677
Synonyms:
N-{4-[(5-bromo-1,3-thiazol-2-yl)amino]phenyl}benzamide | aminothiazole analogue, 21
Type:
Small organic molecule
Emp. Form.:
C16H12BrN3OS
Mol. Mass.:
374.255
SMILES:
Brc1cnc(Nc2ccc(NC(=O)c3ccccc3)cc2)s1
:
Substrate
Name:
CHOCKtide
Synonyms:
Type:
Peptide
Mol. Mass.:
889.06
Organism:
Description:
Residue:
7
LRRWSLG