Target
Aurora kinase A
Ligand
BDBM25686
Substrate
CHOCKtide
Meas. Tech.
Aurora Kinase SPA Assay
IC50
5250±n/a nM
Citation
 Andersen, CBWan, YChang, JWRiggs, BLee, CLiu, YSessa, FVilla, FKwiatkowski, NSuzuki, MNallan, LHeald, RMusacchio, AGray, NS Discovery of selective aminothiazole aurora kinase inhibitors. ACS Chem Biol 3:180-92 (2008)  
Target
Name:
Aurora kinase A
Synonyms:
AIK ARK-1 AURA AURKA_HUMAN Aurora 2 Aurora kinase A (AURKA) Aurora kinase A (Aurora-2) Aurora/IPL1-related kinase 1 Breast tumor-amplified kinase IAK1 STK15 GN Serine/threonine kinase 15 Serine/threonine-protein kinase 6 Serine/threonine-protein kinase aurora-A aurora-2 | hARK1
Type:
Serine/threonine-protein kinase
Mol. Mass.:
45830.98
Organism:
Homo sapiens (Human)
Description:
O14965
Residue:
403
  
Inhibitor
Name:
BDBM25686
Synonyms:
4-[(5-bromo-1,3-thiazol-2-yl)amino]-N-[2-(dimethylamino)ethyl]benzamide | aminothiazole analogue, 30
Type:
Small organic molecule
Emp. Form.:
C14H17BrN4OS
Mol. Mass.:
369.28
SMILES:
CN(C)CCNC(=O)c1ccc(Nc2ncc(Br)s2)cc1
:
Substrate
Name:
CHOCKtide
Synonyms:
Type:
Peptide
Mol. Mass.:
889.06
Organism:
Description:
Residue:
7
LRRWSLG