Target
Aurora kinase A
Ligand
BDBM25720
Substrate
CHOCKtide
Meas. Tech.
Aurora Kinase SPA Assay
IC50
1400±n/a nM
Citation
 Andersen, CBWan, YChang, JWRiggs, BLee, CLiu, YSessa, FVilla, FKwiatkowski, NSuzuki, MNallan, LHeald, RMusacchio, AGray, NS Discovery of selective aminothiazole aurora kinase inhibitors. ACS Chem Biol 3:180-92 (2008)  
Target
Name:
Aurora kinase A
Synonyms:
AIK ARK1 AURKA AYK1 Aurora kinase A (AURA) Aurora kinase A (Aurora A) Aurora-related kinase 1 BTAK Breast-tumor-amplified kinase STK15 Serine/threonine kinase 15 Serine/threonine-protein kinase aurora A hARK1
Type:
Serine/threonine-protein kinase
Mol. Mass.:
45830.98
Organism:
Homo sapiens (Human)
Description:
O14965
Residue:
403
  
Inhibitor
Name:
BDBM25720
Synonyms:
2-{[5-(morpholin-4-ylmethyl)pyridin-2-yl]amino}-1,3-thiazole-5-carbonitrile | aminothiazole analogue, 69
Type:
Small organic molecule
Emp. Form.:
C14H15N5OS
Mol. Mass.:
301.367
SMILES:
N#Cc1cnc(Nc2ccc(CN3CCOCC3)cn2)s1
:
Substrate
Name:
CHOCKtide
Synonyms:
Type:
Peptide
Mol. Mass.:
889.06
Organism:
Description:
Residue:
7
LRRWSLG