Target
Dimer of Gag-Pol polyprotein [489-587]
Ligand
BDBM493
Substrate
HIV Protease substrate
Meas. Tech.
Protease Inhibition Assay
pH
6.4±n/a
Temperature
298.15±n/a K
IC50
105±n/a nM
Citation
 Getman, DPDeCrescenzo, GAHeintz, RMReed, KLTalley, JJBryant, MLClare, MHouseman, KAMarr, JJMueller, RA Discovery of a novel class of potent HIV-1 protease inhibitors containing the (R)-(hydroxyethyl)urea isostere. J Med Chem 36:288-91 (1993)  
Target
Name:
Dimer of Gag-Pol polyprotein [489-587]
Synonyms:
HIV-1 Protease
Type:
Protein Complex
Mol. Mass.:
Description:
Components:
This complex has 2 components.
Component 1
Name:
Gag-Pol polyprotein [489-587]
Synonyms:
HIV protease HIV-1 Protease chain A POL_HV1N5 | gag-pol
Type:
Enzyme Subunit
Mol. Mass.:
10822.21
Organism:
Human immunodeficiency virus type 1
Description:
P12497[489-587]
Residue:
99
  
Component 2
Name:
Gag-Pol polyprotein [489-587]
Synonyms:
HIV protease HIV-1 Protease chain A POL_HV1N5 | gag-pol
Type:
Enzyme Subunit
Mol. Mass.:
10822.21
Organism:
Human immunodeficiency virus type 1
Description:
P12497[489-587]
Residue:
99
  
Inhibitor
Name:
BDBM493
Synonyms:
(Hydroxyethyl)urea Isostere deriv. 21 | benzyl N-[(1S)-1-{[(2S,3R)-4-[(tert-butylcarbamoyl)(pyridin-4-ylmethyl)amino]-3-hydroxy-1-phenylbutan-2-yl]carbamoyl}-2-carbamoylethyl]carbamate
Type:
Small organic molecule
Emp. Form.:
C33H42N6O6
Mol. Mass.:
618.7232
SMILES:
CC(C)(C)NC(=O)N(C[C@@H](O)[C@H](Cc1ccccc1)NC(=O)[C@H](CC(N)=O)NC(=O)OCc1ccccc1)Cc1ccncc1
:
Substrate
Name:
HIV Protease substrate
Synonyms:
Fluorogenic Peptide Substrate
Type:
Peptide
Mol. Mass.:
3467.28
Organism:
Description:
Residue:
30