Target
Tyrosine-protein kinase Tec
Ligand
BDBM1773
Substrate
Meas. Tech.
Lanthscreen Eu Kinase Binding Assay
IC50
12.0±n/a nM
Citation
 Bosanac, TBentzien, JBurke, MJFryer, RMLarson, ETMao, WMcKibben, BPShen, YSoleymanzadeh, FTschantz, MA Heteroaromatic compounds as BTK inhibitors US Patent  US9975882 Publication Date 5/22/2018 
Target
Name:
Tyrosine-protein kinase Tec
Synonyms:
PSCTK4 TEC_HUMAN | Tyrosine-protein kinase TEC (TEC)
Type:
Protein
Mol. Mass.:
73597.00
Organism:
Homo sapiens (Human)
Description:
Residue:
631
  
Inhibitor
Name:
BDBM1773
Synonyms:
US10280174, Comparative Compound 1 US8497277, 13 US9133201, 13 US9133201, 4 | US9975882, comparative compound A
Type:
Emp. Form.:
C25H24N6O2
Mol. Mass.:
440.4971
SMILES:
Nc1ncnc2n(nc(-c3ccc(Oc4ccccc4)cc3)c12)C1CCCN(C1)C(=O)C=C
: