Target
Bcl-2-like protein 1
Ligand
BDBM31378
Substrate
Fl-Bak peptide
Meas. Tech.
Fluorescence Polarization Assay
pH
7.4±n/a
Temperature
298.15±n/a K
Ki
1850±320 nM
Citation
 Yin, HLee, GISedey, KARodriguez, JMWang, HGSebti, SMHamilton, AD Terephthalamide derivatives as mimetics of helical peptides: disruption of the Bcl-x(L)/Bak interaction. J Am Chem Soc 127:5463-8 (2005)  
Target
Name:
Bcl-2-like protein 1
Synonyms:
Anti-apoptotic Bcl-2 protein Apoptosis regulator Bcl-X BCL2-like 1 isoform 1 BCL2L1 Bcl-2-like protein 1 (Bcl-XL) Bcl-xL/Bcl-2-binding component 3 Bcl2-antagonist of cell death (BAD)
Type:
Mitochondrion membrane; Single-pass membrane protein
Mol. Mass.:
26039.60
Organism:
Homo sapiens (Human)
Description:
Residue:
233
  
Inhibitor
Name:
BDBM31378
Synonyms:
CHEMBL284686 | terephthalamide scaffold, 26
Type:
Small organic molecule
Emp. Form.:
C22H34N2O5
Mol. Mass.:
406.5158
SMILES:
COC(=O)[C@H](CC(C)C)NC(=O)c1ccc(cc1OC)C(=O)N(C(C)C)C(C)C
:
Substrate
Name:
Fl-Bak peptide
Synonyms:
Type:
Fluoroscein-labled peptide
Mol. Mass.:
2079.80
Organism:
Description:
The N-terminus of fluoroscein-labled Bak peptide was capped with the fluorophore and the C-terminus was amidated.
Residue:
19
GQVGRQLAIIGDDINRCNH