Target
Aurora kinase A
Ligand
BDBM31093
Substrate
Histone H3 (aa 1-18)
Meas. Tech.
Enzyme Inhibition Assay
pH
7.5±n/a
Temperature
295.15±n/a K
IC50
1±n/a nM
Citation
 Aliagas-Martin, IBurdick, DCorson, LDotson, JDrummond, JFields, CHuang, OWHunsaker, TKleinheinz, TKrueger, ELiang, JMoffat, JPhillips, GPulk, RRawson, TEUltsch, MWalker, LWiesmann, CZhang, BZhu, BYCochran, AG A class of 2,4-bisanilinopyrimidine Aurora A inhibitors with unusually high selectivity against Aurora B. J Med Chem 52:3300-7 (2009)  
Target
Name:
Aurora kinase A
Synonyms:
AIK ARK1 AURKA AYK1 Aurora kinase A (AURA) Aurora kinase A (Aurora A) Aurora-related kinase 1 BTAK Breast-tumor-amplified kinase STK15 Serine/threonine kinase 15 Serine/threonine-protein kinase aurora A hARK1
Type:
Serine/threonine-protein kinase
Mol. Mass.:
45830.98
Organism:
Homo sapiens (Human)
Description:
O14965
Residue:
403
  
Inhibitor
Name:
BDBM31093
Synonyms:
4-[[7-[2,6-bis(fluoranyl)phenyl]-9-chloranyl-5H-pyrimido[5,4-d][2]benzazepin-2-yl]amino]benzoic acid BDBM31832 MLN-8054 | cid_11712649
Type:
Small organic molecule
Emp. Form.:
C25H15ClF2N4O2
Mol. Mass.:
476.862
SMILES:
OC(=O)c1ccc(Nc2ncc3CN=C(c4cc(Cl)ccc4-c3n2)c2c(F)cccc2F)cc1
:
Substrate
Name:
Histone H3 (aa 1-18)
Synonyms:
GST fusion of N-terminus of Histone H3 (aa 1-18) H3C1 H3FB H3FD H3FH H3FJ H3FL HIST1H3B HIST1H3E HIST1H3G HIST1H3I Histone H3
Type:
Peptide
Mol. Mass.:
1951.30
Organism:
Homo sapiens (Human)
Description:
P68431 (aa 1-18)
Residue:
18
MARTKQTARKSTGGKAPR