Target
Peptidyl-prolyl cis-trans isomerase NIMA-interacting 1
Ligand
BDBM34016
Substrate
BDBM34002
Meas. Tech.
Pin1 Enzymatic Activity Assay
pH
7.5±n/a
Temperature
288.15±n/a K
Ki
89±n/a nM
Citation
 Guo, CHou, XDong, LDagostino, EGreasley, SFerre, RMarakovits, JJohnson, MCMatthews, DMroczkowski, BParge, HVanarsdale, TPopoff, IPiraino, JMargosiak, SThomson, JLos, GMurray, BW Structure-based design of novel human Pin1 inhibitors (I). Bioorg Med Chem Lett 19:5613-6 (2009)  
Target
Name:
Peptidyl-prolyl cis-trans isomerase NIMA-interacting 1
Synonyms:
PIN1 PPIase Pin1 | Peptidyl-prolyl cis-trans isomerase NIMA-interacting 1
Type:
PROTEIN
Mol. Mass.:
18248.11
Organism:
Homo sapiens (Human)
Description:
ChEMBL_1502595
Residue:
163
  
Inhibitor
Name:
BDBM34016
Synonyms:
2,3-difluorophenylalanine derivative, 23b
Type:
Small organic molecule
Emp. Form.:
C18H16F2NO5PS
Mol. Mass.:
427.359
SMILES:
OP(O)(=O)OC[C@@H](Cc1cccc(F)c1F)NC(=O)c1cc2ccccc2s1
:
Substrate
Name:
BDBM34002
Synonyms:
cis-Suc-AEPFpNA
Type:
fluorogenic substrate
Emp. Form.:
Mol. Mass.:
SMILES:
: