Target
NAD(P)H dehydrogenase [quinone] 1
Ligand
BDBM35533
Substrate
BDBM24778
Meas. Tech.
Inhibition of NQO1 (With 2 uM BSA)
pH
7.5±n/a
IC50
4.9±n/a nM
Comments
extracted
Citation
 Nolan, KADoncaster, JRDunstan, MSScott, KAFrenkel, ADSiegel, DRoss, DBarnes, JLevy, CLeys, DWhitehead, RCStratford, IJBryce, RA Synthesis and biological evaluation of coumarin-based inhibitors of NAD(P)H: quinone oxidoreductase-1 (NQO1). J Med Chem 52:7142-56 (2009)  
Target
Name:
NAD(P)H dehydrogenase [quinone] 1
Synonyms:
Azoreductase DT-diaphorase NAD(P)H:quinone oxidoreductase 1 NQO1 Phylloquinone reductase Quinone Reductase 1 | Quinone reductase 1)
Type:
Homodimer
Mol. Mass.:
30874.82
Organism:
Homo sapiens (Human)
Description:
Residue:
274
  
Inhibitor
Name:
BDBM35533
Synonyms:
symmetric dicoumarol analogue, 9
Type:
Small organic molecule
Emp. Form.:
C19H8Br4O6
Mol. Mass.:
651.879
SMILES:
Oc1c(Cc2c(O)c3cc(Br)cc(Br)c3oc2=O)c(=O)oc2c(Br)cc(Br)cc12
:
Substrate
Name:
BDBM24778
Synonyms:
2-methyl-1,4-dihydronaphthalene-1,4-dione CHEMBL590 Menadione (5d) Menadione, 9 cid_4055
Type:
Small organic molecule
Emp. Form.:
C11H8O2
Mol. Mass.:
172.18
SMILES:
CC1=CC(=O)c2ccccc2C1=O
: