Target
Beta-lactamase
Ligand
BDBM36640
Substrate
Meas. Tech.
Metallo-Beta-Lactamase Assay
pH
7±0
Temperature
310.15±0 K
IC50
1.9e+3± 2e+2 nM
Citation
 Toney, JHFitzgerald, PMGrover-Sharma, NOlson, SHMay, WJSundelof, JGVanderwall, DECleary, KAGrant, SKWu, JKKozarich, JWPompliano, DLHammond, GG Antibiotic sensitization using biphenyl tetrazoles as potent inhibitors of Bacteroides fragilis metallo-beta-lactamase. Chem Biol 5:185-96 (1998)  
Target
Name:
Beta-lactamase
Synonyms:
Metallo-beta-lactamase
Type:
Protein
Mol. Mass.:
27160.75
Organism:
Bacteroides fragilis
Description:
Q8KZP2
Residue:
249
  
Inhibitor
Name:
BDBM36640
Synonyms:
CHEMBL26514 | L-159,061
Type:
Small organic molecule
Emp. Form.:
C26H24N6O2
Mol. Mass.:
452.5078
SMILES:
CCCCc1nc2ccc(O)cc2c(=O)n1Cc1ccc(cc1)-c1ccccc1-c1nnn[nH]1
: