Target
Serine/threonine-protein phosphatase 2A activator
Ligand
BDBM40782
Substrate
Meas. Tech.
Inhibition Assay
IC50
1.1±n/a nM
Citation
 Wakimoto, TMatsunaga, STakai, AFusetani, N Insight into binding of calyculin A to protein phosphatase 1: isolation of hemicalyculin a and chemical transformation of calyculin A. Chem Biol 9:309-19 (2002)  
Target
Name:
Serine/threonine-protein phosphatase 2A activator
Synonyms:
5.2.1.8 PTPA Phosphotyrosyl phosphatase activator Protein phosphatase 2A regulatory subunit B' Serine/threonine-protein phosphatase 2A regulatory subunit 4
Type:
Mol. Mass.:
40662.53
Organism:
Homo sapiens (Human)
Description:
Q15257
Residue:
358
  
Inhibitor
Name:
BDBM40782
Synonyms:
C1/C34-Calyculin A (15)
Type:
Small organic molecule
Emp. Form.:
C44H68N3O13P
Mol. Mass.:
877.9968
SMILES:
CO[C@@H](C[C@H](O)C(C)[C@H](O)C(C)\C=C(/C)\C(\C)=C\C=C\C(\C)=C\C#N)[C@H]1OC2(C[C@@H](O)[C@H](C)C(C\C=C\c3coc(n3)C(C)CCNC(=O)CO)O2)C(C)(C)[C@H]1OP(O)(O)=O
: