Target
Tyrosine-protein kinase BTK
Ligand
BDBM267670
Substrate
Meas. Tech.
Btk Enzyme Activity Assay A
pH
7.2±n/a
Temperature
298.15±n/a K
EC50
<10.00±n/a nM
Comments
extracted
Citation
Target
Name:
Tyrosine-protein kinase BTK
Synonyms:
AGMX1 Agammaglobulinaemia tyrosine kinase B cell progenitor kinase BPK BTK_HUMAN Tyrosine Kinase BTK Tyrosine-protein kinase BTK (BTK)
Type:
Enzyme
Mol. Mass.:
76289.95
Organism:
Homo sapiens (Human)
Description:
Q06187
Residue:
659
  
Inhibitor
Name:
BDBM267670
Synonyms:
(R)-3-(4-amino-3-(4-(4-(trifluoromethyl)pyridin-2-ylcarbamoyl)phenyl)-1H-pyrazolo[3,4-d]pyrimidin-1-yl)-N-ethylpiperidine-1-carboxamide | US9718828, Example, 269
Type:
Small organic molecule
Emp. Form.:
C27H25F3N8O2
Mol. Mass.:
550.535
SMILES:
Nc1ncnc2n(nc(-c3ccc(cc3)C(=O)Nc3cc(ccn3)C(F)(F)F)c12)[C@@H]1CCCN(C1)C(=O)C1CC1
: