Target
Tyrosine-protein kinase BTK
Ligand
BDBM267689
Substrate
Meas. Tech.
Btk Enzyme Activity Assay A
pH
7.2±n/a
Temperature
298.15±n/a K
EC50
<10.00±n/a nM
Comments
extracted
Citation
Target
Name:
Tyrosine-protein kinase BTK
Synonyms:
AGMX1 Agammaglobulinaemia tyrosine kinase B cell progenitor kinase BPK BTK_HUMAN Tyrosine Kinase BTK Tyrosine-protein kinase BTK (BTK)
Type:
Enzyme
Mol. Mass.:
76289.95
Organism:
Homo sapiens (Human)
Description:
Q06187
Residue:
659
  
Inhibitor
Name:
BDBM267689
Synonyms:
(R)-6-(8-amino-3-(1-(3-methoxypropanoyl)piperidin-3-yl)imidazo[1,5-a]pyrazin-1-yl)-N-(pyridin-2-yl) nicotinamide | US9718828, Example, 289
Type:
Small organic molecule
Emp. Form.:
C29H31N7O4
Mol. Mass.:
541.6009
SMILES:
Nc1nccn2c(nc(-c3ccc(cc3)C(=O)Nc3cc(ccn3)C3CC3)c12)[C@@H]1CCCN(C1)C(=O)[C@H](O)CO
: