Target
Tyrosine-protein kinase BTK
Ligand
BDBM267703
Substrate
Meas. Tech.
Btk Enzyme Activity Assay A
pH
7.2±n/a
Temperature
298.15±n/a K
EC50
<10.00±n/a nM
Comments
extracted
Citation
Target
Name:
Tyrosine-protein kinase BTK
Synonyms:
AGMX1 Agammaglobulinaemia tyrosine kinase B cell progenitor kinase BPK BTK_HUMAN Tyrosine Kinase BTK Tyrosine-protein kinase BTK (BTK)
Type:
Enzyme
Mol. Mass.:
76289.95
Organism:
Homo sapiens (Human)
Description:
Q06187
Residue:
659
  
Inhibitor
Name:
BDBM267703
Synonyms:
(R)-4-(8-amino-5-deutero-3-(1-(3-methoxypropanoyl) piperidin-3-yl)imidazo[1,5-a]pyrazin-1-yl)-N-(4-(trifluoromethyl)pyridin-2-yl)benzamide | US9718828, Example, 305
Type:
Small organic molecule
Emp. Form.:
C29H28F3N7O3
Mol. Mass.:
579.5729
SMILES:
CC1(COC1)C(=O)N1CCC[C@H](C1)c1nc(-c2ccc(cc2)C(=O)Nc2cc(ccn2)C(F)(F)F)c2c(N)nccn12
: