Target
Protein kinase C beta type
Ligand
BDBM2618
Substrate
Lysine-rich histone
Meas. Tech.
PKC assay
IC50
15000±n/a nM
Citation
 Davis, PDHill, CHLawton, GNixon, JSWilkinson, SEHurst, SAKeech, ETurner, SE Inhibitors of protein kinase C. 1. 2,3-Bisarylmaleimides. J Med Chem 35:177-84 (1992)  
Target
Name:
Protein kinase C beta type
Synonyms:
KPCB_RAT Pkcb Prkcb1 Protein kinase C (PKC) | Protein kinase C beta
Type:
Enzyme Mixture
Mol. Mass.:
76755.54
Organism:
Rattus norvegicus (rat)
Description:
PKC from rat brain is known to contain predominately the conventional PKC isoforms, alpha, beta I, beta II, gamma.
Residue:
671
  
Inhibitor
Name:
BDBM2618
Synonyms:
Bisindolylmaleimide deriv. 40 | N-{1-methyl-3-[4-(1-methyl-1H-indol-3-yl)-2,5-dioxo-2,5-dihydro-1H-pyrrol-3-yl]-1H-indol-5-yl}acetamide
Type:
Small organic molecule
Emp. Form.:
C24H20N4O3
Mol. Mass.:
412.4406
SMILES:
CC(=O)Nc1ccc2n(C)cc(C3=C(C(=O)NC3=O)c3cn(C)c4ccccc34)c2c1
:
Substrate
Name:
Lysine-rich histone
Synonyms:
ING Peptide histone type IIIS
Type:
Peptide
Mol. Mass.:
10508.21
Organism:
Bos taurus (bovine)
Description:
Purified as a lysine rich fraction of histone H1 from calf thymus.
Residue:
105