Target
Protein disulfide-isomerase
Ligand
BDBM271342
Substrate
Meas. Tech.
Insulin reductase assay
IC50
4000±n/a nM
Citation
 Flaumenhaft, RNag, PPPilyugina, TPu, JDandapani, SMunoz, BDockendorff, C Compounds for use in methods for treating diseases or conditions mediated by protein disulfide isomerase US Patent  US10064853 Publication Date 9/4/2018 
Target
Name:
Protein disulfide-isomerase
Synonyms:
Cellular thyroid hormone-binding protein P4HB PDIA1 PO4DB | Protein Disulfide-Isomerase (PDI)
Type:
Protein
Mol. Mass.:
57084.91
Organism:
Homo sapiens (Human)
Description:
P07237
Residue:
508
  
Inhibitor
Name:
BDBM271342
Synonyms:
US10064853, Compound 17
Type:
Small organic molecule
Emp. Form.:
C26H33ClN2O3
Mol. Mass.:
457.005
SMILES:
Oc1ccc(CN2CCC(CCOc3ccccc3)(CC2)C(=O)NC2CCCC2)cc1Cl
: