Target
Mu-type opioid receptor
Ligand
BDBM50001848
Substrate
Meas. Tech.
ChEBML_146420
IC50
0.130000±n/a nM
Citation
 Chandrakumar, NSYonan, PKStapelfeld, ASavage, MRorbacher, EContreras, PCHammond, D Preparation and opioid activity of analogues of the analgesic dipeptide 2,6-dimethyl-L-tyrosyl-N-(3-phenylpropyl)-D-alaninamide. J Med Chem 35:223-33 (1992)  
Target
Name:
Mu-type opioid receptor
Synonyms:
MOR-1 Mu-type opioid receptor (MOR) OPRM_RAT Opioid receptor B Ror-b
Type:
G Protein-Coupled Receptor (GPCR)
Mol. Mass.:
44503.11
Organism:
Rattus norvegicus (rat)
Description:
Competition binding assays were carried out using membrane preparations from transfected HN9.10 cells that constitutively expressed the mu opioid receptor.
Residue:
398
  
Inhibitor
Name:
BDBM50001848
Synonyms:
2-Amino-3-(4-hydroxy-2,6-dimethyl-phenyl)-N-[1-methyl-2-(3-phenyl-propylamino)-ethyl]-propionamide | CHEMBL76527
Type:
Small organic molecule
Emp. Form.:
C23H33N3O2
Mol. Mass.:
383.527
SMILES:
C[C@H](CNCCCc1ccccc1)NC(=O)C(N)Cc1c(C)cc(O)cc1C
: