Target
Muscarinic acetylcholine receptor M2
Ligand
BDBM50004656
Substrate
Meas. Tech.
ChEMBL_1676738 (CHEMBL4026881)
EC50
890±n/a nM
Citation
 Fish, IStößel, AEitel, KValant, CAlbold, SHuebner, HMöller, DClark, MJSunahara, RKChristopoulos, AShoichet, BKGmeiner, P Structure-Based Design and Discovery of New M J Med Chem 60:9239-9250 (2017)  
Target
Name:
Muscarinic acetylcholine receptor M2
Synonyms:
ACM2_HUMAN Cholinergic, muscarinic M2 Muscarinic acetylcholine receptor M2 and M5 | RecName: Full=Muscarinic acetylcholine receptor M2
Type:
GPCR
Mol. Mass.:
51730.61
Organism:
Homo sapiens (Human)
Description:
P08172
Residue:
466
  
Inhibitor
Name:
BDBM50004656
Synonyms:
(2-Carbamoyloxy-ethyl)-trimethyl-ammonium (2-Hydroxyethyl)trimethyl ammonium chloride carbamate (carbachol)(2-Carbamoyloxy-ethyl)-trimethyl-ammonium 2-((Aminocarbonyl)oxy)-N,N,N-trimethylethanaminum chloride 2-(carbamoyloxy)-N,N,N-trimethylethanaminium chloride CARBASTAT Carbachol chloride Choline carbamate chloride Choline chlorine carbamate Karbamoylcholin chlorid | MIOSTAT
Type:
Small organic molecule
Emp. Form.:
C6H15N2O2
Mol. Mass.:
147.195
SMILES:
C[N+](C)(C)CCOC(N)=O
: