Target
Sigma non-opioid intracellular receptor 1
Ligand
BDBM50004113
Substrate
Meas. Tech.
ChEBML_201744
Ki
3720±n/a nM
Citation
 de Costa, BRMattson, MVGeorge, CLinders, JT Synthesis, configuration, and activity of isomeric 2-phenyl-2-(N-piperidinyl)bicyclo[3.1.0]hexanes at phencyclidine and sigma binding sites. J Med Chem 35:4704-12 (1993)  
Target
Name:
Sigma non-opioid intracellular receptor 1
Synonyms:
Aging-associated gene 8 protein SGMR1_HUMAN SIGMAR1 SR31747-binding protein Sigma 1-type opioid receptor Sigma1R | hSigmaR1
Type:
Enzyme Catalytic Domain
Mol. Mass.:
25124.85
Organism:
Homo sapiens (Human)
Description:
Q99720
Residue:
223
  
Inhibitor
Name:
BDBM50004113
Synonyms:
1-(3-Phenyl-bicyclo[3.1.0]hex-3-yl)-piperidine | CHEMBL347761
Type:
Small organic molecule
Emp. Form.:
C17H23N
Mol. Mass.:
241.3712
SMILES:
C1[C@H]2C[C@@](C[C@@H]12)(N1CCCCC1)c1ccccc1
: