Target
Sodium channel protein type 9 subunit alpha
Ligand
BDBM50257215
Substrate
Meas. Tech.
ChEBML_1689561
IC50
124±n/a nM
Citation
 Swain, NABatchelor, DBeaudoin, SBechle, BMBradley, PABrown, ADBrown, BButcher, KJButt, RPChapman, MLDenton, SEllis, DGalan, SRGGaulier, SMGreener, BSde Groot, MJGlossop, MSGurrell, IKHannam, JJohnson, MSLin, ZMarkworth, CJMarron, BEMillan, DSNakagawa, SPike, APrintzenhoff, DRawson, DJRansley, SJReister, SMSasaki, KStorer, RIStupple, PAWest, CW Discovery of Clinical Candidate 4-[2-(5-Amino-1H-pyrazol-4-yl)-4-chlorophenoxy]-5-chloro-2-fluoro-N-1,3-thiazol-4-ylbenzenesulfonamide (PF-05089771): Design and Optimization of Diaryl Ether Aryl Sulfonamides as Selective Inhibitors of Na J Med Chem 60:7029-7042 (2017)  
Target
Name:
Sodium channel protein type 9 subunit alpha
Synonyms:
PN1 SCN9A_RAT Sodium channel protein type 9 subunit alpha Sodium channel protein type IX subunit alpha Voltage-gated sodium channel subunit alpha Nav1.7
Type:
PROTEIN
Mol. Mass.:
226035.47
Organism:
Rattus norvegicus
Description:
ChEMBL_1516887
Residue:
1984
  
Inhibitor
Name:
BDBM50257215
Synonyms:
CHEMBL2324411
Type:
Small organic molecule
Emp. Form.:
C18H13ClFN5O3S2
Mol. Mass.:
465.909
SMILES:
Cn1nccc1-c1cc(Cl)ccc1Oc1ccc(cc1F)S(=O)(=O)Nc1ncns1
: