Target
Muscarinic acetylcholine receptor M4
Ligand
BDBM50012338
Substrate
Meas. Tech.
ChEBML_139254
Ki
23±n/a nM
Citation
 Karton, YBradbury, BJBaumgold, JPaek, RJacobson, KA Functionalized congener approach to muscarinic antagonists: analogues of pirenzepine. J Med Chem 34:2133-45 (1991)  
Target
Name:
Muscarinic acetylcholine receptor M4
Synonyms:
ACM4_RAT Chrm-4 | Chrm4
Type:
Enzyme Catalytic Domain
Mol. Mass.:
52841.70
Organism:
RAT
Description:
Cholinergic, muscarinic M4 CHRM4 RAT::P08485
Residue:
477
  
Inhibitor
Name:
BDBM50012338
Synonyms:
(6-{4-[2-Oxo-2-(6-oxo-5,6-dihydro-benzo[e]pyrido[3,2-b][1,4]diazepin-11-yl)-ethyl]-piperazin-1-yl}-hexyl)-carbamic acid tert-butyl ester | CHEMBL303684
Type:
Small organic molecule
Emp. Form.:
C29H40N6O4
Mol. Mass.:
536.6657
SMILES:
CC(C)(C)OC(=O)NCCCCCCN1CCN(CC(=O)N2c3ccccc3C(=O)Nc3cccnc23)CC1
: