Target
P2Y purinoceptor 2
Ligand
BDBM50205417
Substrate
Meas. Tech.
ChEMBL_1711179 (CHEMBL4121228)
Ki
3467±n/a nM
Citation
 Conroy, SKindon, NDGlenn, JStoddart, LALewis, RJHill, SJKellam, BStocks, MJ Synthesis and Evaluation of the First Fluorescent Antagonists of the Human P2Y J Med Chem 61:3089-3113 (2018)  
Target
Name:
P2Y purinoceptor 2
Synonyms:
ATP receptor P2RY2 P2U purinoceptor 1 P2Y purinoceptor 2 Purinergic receptor | Purinergic receptor P2Y2
Type:
PROTEIN
Mol. Mass.:
42299.21
Organism:
Homo sapiens (Human)
Description:
ChEMBL_1455361
Residue:
377
  
Inhibitor
Name:
BDBM50205417
Synonyms:
CHEMBL220200 | UTP-gamma-S
Type:
Small organic molecule
Emp. Form.:
C9H15N2O14P3S
Mol. Mass.:
500.207
SMILES:
O[C@H]1[C@@H](O)[C@@H](O[C@@H]1COP(O)(=O)OP(O)(=O)OP(O)(S)=O)n1ccc(=O)[nH]c1=O
: