Target
Vasopressin V2 receptor
Ligand
BDBM50016312
Substrate
Meas. Tech.
ChEMBL_214691 (CHEMBL817654)
Kd
10±n/a nM
Citation
 Grzonka, ZKasprzykowski, FKojro, EDarlak, KMelin, PFahrenholz, FCrause, PBoer, R Arginine-vasopressin analogues with high antidiuretic/vasopressor selectivity. Synthesis, biological activity, and receptor binding affinity of arginine-vasopressin analogues with substitutions in positions 1, 2, 4, 7, and 8. J Med Chem 29:96-9 (1986)  
Target
Name:
Vasopressin V2 receptor
Synonyms:
AVPR2 VASOPRESSIN V2 | Vasopressin V2 receptor
Type:
Enzyme Catalytic Domain
Mol. Mass.:
40248.83
Organism:
BOVINE
Description:
VASOPRESSIN V2 AVPR2 BOVINE::P48044
Residue:
370
  
Inhibitor
Name:
BDBM50016312
Synonyms:
CHEMBL265119 | [Sar7D-Arg8]VP (Vasopressin )
Type:
Small organic molecule
Emp. Form.:
C44H63N15O12S2
Mol. Mass.:
1058.194
SMILES:
CN(CC(=O)N[C@H](CCCNC(N)=N)C(=O)NCC(N)=O)C(=O)[C@@H]1CSSC[C@@H](N)C(=O)N[C@H](Cc2ccc(O)cc2)C(=O)N[C@@H](Cc2ccccc2)C(=O)N[C@H](CCC(N)=O)C(=O)N[C@@H](CC(N)=O)C(=O)N1
: