Target
Tyrosine-protein kinase Mer
Ligand
BDBM50172079
Substrate
Meas. Tech.
ChEMBL_1754214 (CHEMBL4188974)
IC50
15±n/a nM
Citation
 Myers, SHTemps, CHouston, DRBrunton, VGUnciti-Broceta, A Development of Potent Inhibitors of Receptor Tyrosine Kinases by Ligand-Based Drug Design and Target-Biased Phenotypic Screening. J Med Chem 61:2104-2110 (2018)  
Target
Name:
Tyrosine-protein kinase Mer
Synonyms:
MER MERTK Proto-oncogene c-Mer Receptor tyrosine kinase MerTK | Tyrosine-protein kinase Mer
Type:
PROTEIN
Mol. Mass.:
110234.77
Organism:
Homo sapiens (Human)
Description:
ChEMBL_1498723
Residue:
999
  
Inhibitor
Name:
BDBM50172079
Synonyms:
CHEMBL3809489
Type:
Small organic molecule
Emp. Form.:
C30H34N8
Mol. Mass.:
506.6446
SMILES:
Nc1nc(Nc2ccc3CC[C@@H](CCc3c2)N2CCCC2)nn1-c1cc2CCCc3ccccc3-c2nn1
: