Target
Transcriptional activator protein LasR
Ligand
BDBM50465704
Substrate
Meas. Tech.
ChEMBL_1788569 (CHEMBL4260303)
IC50
1000±n/a nM
Citation
 Soukarieh, FWilliams, PStocks, MJCámara, M Pseudomonas aeruginosa Quorum Sensing Systems as Drug Discovery Targets: Current Position and Future Perspectives. J Med Chem 61:10385-10402 (2018)  
Target
Name:
Transcriptional activator protein LasR
Synonyms:
LASR_PSEAE | lasR
Type:
PROTEIN
Mol. Mass.:
26618.24
Organism:
Pseudomonas aeruginosa
Description:
ChEMBL_1475312
Residue:
239
  
Inhibitor
Name:
BDBM50465704
Synonyms:
CHEMBL4282406
Type:
Small organic molecule
Emp. Form.:
C18H25NO4
Mol. Mass.:
319.3954
SMILES:
CCCCCCCOc1ccc(cc1)C(=O)N[C@H]1CCOC1=O
: