Target
Interstitial collagenase
Ligand
BDBM50240611
Substrate
Meas. Tech.
ChEMBL_106440 (CHEMBL718063)
Ki
2.0±n/a nM
Citation
 Kottirsch, GKoch, GFeifel, RNeumann, U Beta-aryl-succinic acid hydroxamates as dual inhibitors of matrix metalloproteinases and tumor necrosis factor alpha converting enzyme. J Med Chem 45:2289-93 (2002)  
Target
Name:
Interstitial collagenase
Synonyms:
CLG MMP1 Matrix metalloproteinase-1 | Matrix metalloproteinase-1 (MMP-1)
Type:
Enzyme
Mol. Mass.:
54010.26
Organism:
Homo sapiens (Human)
Description:
P03956
Residue:
469
  
Inhibitor
Name:
BDBM50240611
Synonyms:
(2S,3R)-N1-((S)-3,3-dimethyl-1-(methylamino)-1-oxobutan-2-yl)-N4-hydroxy-3-(hydroxymethyl)-2-p-tolylsuccinamide N*4*-(2,2-Dimethyl-1-methylcarbamoyl-propyl)-N*1*-hydroxy-2-hydroxymethyl-3-p-tolyl-succinamide | PKF-241-466
Type:
Small organic molecule
Emp. Form.:
C19H29N3O5
Mol. Mass.:
379.4507
SMILES:
CNC(=O)[C@@H](NC(=O)[C@@H]([C@H](CO)C(=O)NO)c1ccc(C)cc1)C(C)(C)C
: