Target
Reverse transcriptase
Ligand
BDBM50484039
Substrate
Meas. Tech.
ChEMBL_755189 (CHEMBL1805968)
Ki
1.5±n/a nM
Citation
 Su, DSLim, JJTinney, ETucker, TJSaggar, SSisko, JTWan, BLYoung, MBAnderson, KDRudd, DMunshi, VBahnck, CFelock, PJLu, MLai, MTTouch, SMoyer, GDistefano, DJFlynn, JALiang, YSanchez, RPerlow-Poehnelt, RMiller, MVacca, JPWilliams, TMAnthony, NJ Biaryl ethers as potent allosteric inhibitors of reverse transcriptase and its key mutant viruses: aryl substituted pyrazole as a surrogate for the pyrazolopyridine motif. Bioorg Med Chem Lett 20:4328-32 (2010)  
Target
Name:
Reverse transcriptase
Synonyms:
Type:
Protein
Mol. Mass.:
29598.37
Organism:
Human immunodeficiency virus 1
Description:
Q9WKE8
Residue:
254
  
Inhibitor
Name:
BDBM50484039
Synonyms:
CHEMBL1800087
Type:
Small organic molecule
Emp. Form.:
C21H13Cl2N3O3
Mol. Mass.:
426.252
SMILES:
Clc1cc(Oc2cc(OCc3cc([nH]n3)-c3ccco3)ccc2Cl)cc(c1)C#N
: