Target
Reverse transcriptase protein
Ligand
BDBM50484035
Substrate
Meas. Tech.
ChEMBL_755188 (CHEMBL1805967)
Ki
4.4±n/a nM
Citation
 Su, DSLim, JJTinney, ETucker, TJSaggar, SSisko, JTWan, BLYoung, MBAnderson, KDRudd, DMunshi, VBahnck, CFelock, PJLu, MLai, MTTouch, SMoyer, GDistefano, DJFlynn, JALiang, YSanchez, RPerlow-Poehnelt, RMiller, MVacca, JPWilliams, TMAnthony, NJ Biaryl ethers as potent allosteric inhibitors of reverse transcriptase and its key mutant viruses: aryl substituted pyrazole as a surrogate for the pyrazolopyridine motif. Bioorg Med Chem Lett 20:4328-32 (2010)  
Target
Name:
Reverse transcriptase protein
Synonyms:
Reverse Transcriptase Reverse Transcriptase (F61A)
Type:
Protein
Mol. Mass.:
30203.56
Organism:
Human immunodeficiency virus 1
Description:
Q9WJQ2
Residue:
259
  
Inhibitor
Name:
BDBM50484035
Synonyms:
CHEMBL1801266
Type:
Small organic molecule
Emp. Form.:
C23H13Cl3N2O3
Mol. Mass.:
471.72
SMILES:
Clc1ccc(cc1)-c1cnc(COc2ccc(Cl)c(Oc3cc(Cl)cc(c3)C#N)c2)o1
: