Target
Prostaglandin G/H synthase 1
Ligand
BDBM50029593
Substrate
Meas. Tech.
ChEMBL_158594 (CHEMBL769636)
IC50
>100000±n/a nM
Citation
 Li, JJAnderson, GDBurton, EGCogburn, JNCollins, JTGarland, DJGregory, SAHuang, HCIsakson, PCKoboldt, CM 1,2-Diarylcyclopentenes as selective cyclooxygenase-2 inhibitors and orally active anti-inflammatory agents. J Med Chem 38:4570-8 (1995)  
Target
Name:
Prostaglandin G/H synthase 1
Synonyms:
COX-1 Cyclooxygenase Cyclooxygenase-1 (COX-1) PTGS1 | Prostaglandin G/H synthase (cyclooxygenase)
Type:
Enzyme
Mol. Mass.:
68692.62
Organism:
Homo sapiens (Human)
Description:
P23219
Residue:
599
  
Inhibitor
Name:
BDBM50029593
Synonyms:
CHEMBL7162 N-(2-Cyclohexyloxy-4-nitro-phenyl)-methanesulfonamide N-[2-(cyclohexyloxy)-4-nitrophenyl]methane sulfonamide N-{2-(cyclohexyloxy)-4-[hydroxy(oxido)amino]phenyl}methanesulfonamide NS398
Type:
Small organic molecule
Emp. Form.:
C13H18N2O5S
Mol. Mass.:
314.357
SMILES:
CS(=O)(=O)Nc1ccc(cc1OC1CCCCC1)[N+]([O-])=O
: