Target
Potassium-transporting ATPase alpha chain 1/subunit beta
Ligand
BDBM50032108
Substrate
Meas. Tech.
ChEMBL_76069 (CHEMBL688290)
IC50
28±n/a nM
Citation
 Ife, RJBrown, THBlurton, PKeeling, DJLeach, CAMeeson, MLParsons, METheobald, CJ Reversible inhibitors of the gastric (H+/K+)-ATPase. 5. Substituted 2,4-diaminoquinazolines and thienopyrimidines. J Med Chem 38:2763-73 (1995)  
Target
Name:
Potassium-transporting ATPase alpha chain 1/subunit beta
Synonyms:
Potassium-transporting ATPase | Potassium-transporting ATPase alpha chain 1/beta chain
Type:
Mol. Mass.:
Description:
Components:
This complex has 0 components.
Component 1
Name:
Potassium-transporting ATPase subunit beta
Synonyms:
ATP4B Gastric H(+)/K(+) ATPase subunit beta Potassium-transporting ATPase beta chain Proton pump beta chain | gp60-90
Type:
Mol. Mass.:
33083.09
Organism:
Sus scrofa (Pig)
Description:
Residue:
290
  
Component 2
Name:
Potassium-transporting ATPase alpha chain 1
Synonyms:
ATP4A Gastric H(+)/K(+) ATPase subunit alpha Na/K-ATPase Potassium-transporting ATPase alpha chain 1 | Proton pump
Type:
Enzyme
Mol. Mass.:
114279.23
Organism:
Sus scrofa (Pig)
Description:
P19156
Residue:
1034
  
Inhibitor
Name:
BDBM50032108
Synonyms:
4-[(4-Methoxy-phenyl)-methyl-amino]-1-methyl-2-o-tolylamino-quinazolin-1-ium; iodide | CHEMBL92510
Type:
Small organic molecule
Emp. Form.:
C24H25N4O
Mol. Mass.:
385.481
SMILES:
COc1ccc(cc1)[N+](\C)=c1\nc(Nc2ccccc2C)n(C)c2ccccc12
: