Target
Adenylate cyclase type 1
Ligand
BDBM50010267
Substrate
Meas. Tech.
ChEMBL_31879 (CHEMBL645669)
IC50
>150±n/a nM
Citation
 Robbins, JDBoring, DLTang, WJShank, RSeamon, KB Forskolin carbamates: binding and activation studies with type I adenylyl cyclase. J Med Chem 39:2745-52 (1996)  
Target
Name:
Adenylate cyclase type 1
Synonyms:
ADCY1 Adenylate cyclase | Brain adenylate cyclase 1
Type:
PROTEIN
Mol. Mass.:
123469.95
Organism:
Homo sapiens (Human)
Description:
ChEMBL_31877
Residue:
1119
  
Inhibitor
Name:
BDBM50010267
Synonyms:
CHEMBL92719 [2-(4-Hydroxy-phenyl)-ethyl]-carbamic acid 5,10,10b-trihydroxy-3,4a,7,7,10a-pentamethyl-1-oxo-3-vinyl-dodecahydro-benzo[f]chromen-6-yl ester
Type:
Small organic molecule
Emp. Form.:
C29H41NO8
Mol. Mass.:
531.6377
SMILES:
CC1(C)CC[C@H](O)[C@@]2(C)[C@H]1[C@H](OC(=O)NCCc1ccc(O)cc1)[C@H](O)[C@@]1(C)O[C@](C)(CC(=O)[C@]21O)C=C
: