Target
Trifunctional purine biosynthetic protein adenosine-3
Ligand
BDBM50059335
Substrate
Meas. Tech.
ChEMBL_72910 (CHEMBL684724)
Ki
28±n/a nM
Citation
 Varney, MDPalmer, CLRomines, WHBoritzki, TMargosiak, SAAlmassy, RJanson, CABartlett, CHowland, EJFerre, R Protein structure-based design, synthesis, and biological evaluation of 5-thia-2,6-diamino-4(3H)-oxopyrimidines: potent inhibitors of glycinamide ribonucleotide transformylase with potent cell growth inhibition. J Med Chem 40:2502-24 (1997)  
Target
Name:
Trifunctional purine biosynthetic protein adenosine-3
Synonyms:
GAR Tfase GART Glycinamide ribonucleotide transformylase (GAR Tfase) PRGS Thymidylate synthase/GAR transformylase/AICAR transformylase
Type:
Protein
Mol. Mass.:
107768.47
Organism:
Homo sapiens (Human)
Description:
P22102
Residue:
1010
  
Inhibitor
Name:
BDBM50059335
Synonyms:
(S)-2-({5-[2-(2-Amino-4-oxo-4,6,7,8-tetrahydro-3H-pyrimido[5,4-b][1,4]thiazin-6-yl)-ethyl]-thiophene-2-carbonyl}-amino)-pentanedioic acid | CHEMBL84163
Type:
Small organic molecule
Emp. Form.:
C18H21N5O6S2
Mol. Mass.:
467.519
SMILES:
Nc1nc2NCC(CCc3ccc(s3)C(=O)N[C@@H](CCC(O)=O)C(O)=O)Sc2c(=O)[nH]1
: