Target
Sterol O-acyltransferase 1
Ligand
BDBM50063221
Substrate
Meas. Tech.
ChEMBL_28497 (CHEMBL645927)
IC50
16±n/a nM
Citation
 Sliskovic, DRPicard, JAO'Brien, PMLiao, PRoark, WHRoth, BDAnderson, MAMueller, SBBocan, TMBousley, RFHamelehle, KLHoman, RReindel, JFStanfield, RLTurluck, DKrause, BR alpha-Substituted malonester amides: tools to define the relationship between ACAT inhibition and adrenal toxicity. J Med Chem 41:682-90 (1998)  
Target
Name:
Sterol O-acyltransferase 1
Synonyms:
ACAT-1 Acat SOAT1_RAT Sterol O-acyltransferase, Soat
Type:
PROTEIN
Mol. Mass.:
64165.56
Organism:
Rattus norvegicus
Description:
ChEMBL_28796
Residue:
545
  
Inhibitor
Name:
BDBM50063221
Synonyms:
CHEMBL161295 | N-(2,6-Diisopropyl-phenyl)-2-phenyl-malonamic acid tetradecyl ester
Type:
Small organic molecule
Emp. Form.:
C35H53NO3
Mol. Mass.:
535.8002
SMILES:
CCCCCCCCCCCCCCOC(=O)C(C(=O)Nc1c(cccc1C(C)C)C(C)C)c1ccccc1
: