Target
Sterol O-acyltransferase 1
Ligand
BDBM50063232
Substrate
Meas. Tech.
ChEMBL_28497 (CHEMBL645927)
IC50
13±n/a nM
Citation
 Sliskovic, DRPicard, JAO'Brien, PMLiao, PRoark, WHRoth, BDAnderson, MAMueller, SBBocan, TMBousley, RFHamelehle, KLHoman, RReindel, JFStanfield, RLTurluck, DKrause, BR alpha-Substituted malonester amides: tools to define the relationship between ACAT inhibition and adrenal toxicity. J Med Chem 41:682-90 (1998)  
Target
Name:
Sterol O-acyltransferase 1
Synonyms:
ACAT-1 Acat SOAT1_RAT Sterol O-acyltransferase, Soat
Type:
PROTEIN
Mol. Mass.:
64165.56
Organism:
Rattus norvegicus
Description:
ChEMBL_28796
Residue:
545
  
Inhibitor
Name:
BDBM50063232
Synonyms:
2-Phenyl-N-(2,4,6-trimethoxy-phenyl)-malonamic acid dodecyl ester | CHEMBL348776
Type:
Small organic molecule
Emp. Form.:
C30H43NO6
Mol. Mass.:
513.6655
SMILES:
CCCCCCCCCCCCOC(=O)C(C(=O)Nc1c(OC)cc(OC)cc1OC)c1ccccc1
: