Target
Serine protease 1
Ligand
BDBM50066333
Substrate
Meas. Tech.
ChEMBL_212735 (CHEMBL819276)
Ki
18000±n/a nM
Citation
 Tucker, TJBrady, SFLumma, WCLewis, SDGardell, SJNaylor-Olsen, AMYan, YSisko, JTStauffer, KJLucas, BJLynch, JJCook, JJStranieri, MTHolahan, MALyle, EABaskin, EPChen, IWDancheck, KBKrueger, JACooper, CMVacca, JP Design and synthesis of a series of potent and orally bioavailable noncovalent thrombin inhibitors that utilize nonbasic groups in the P1 position. J Med Chem 41:3210-9 (1998)  
Target
Name:
Serine protease 1
Synonyms:
Alpha-trypsin chain 1 Beta-trypsin PRSS1 TRP1 TRY1_HUMAN Thrombin & trypsin Trypsin I | Trypsin-1
Type:
Enzyme
Mol. Mass.:
26557.80
Organism:
Homo sapiens (Human)
Description:
P07477
Residue:
247
  
Inhibitor
Name:
BDBM50066333
Synonyms:
(S)-1-((R)-2-Amino-2-cyclohexyl-acetyl)-pyrrolidine-2-carboxylic acid 5-chloro-2-cyclopropylcarbamoylmethoxy-benzylamide | CHEMBL108202
Type:
Small organic molecule
Emp. Form.:
C25H35ClN4O4
Mol. Mass.:
491.023
SMILES:
N[C@H](C1CCCCC1)C(=O)N1CCC[C@H]1C(=O)NCc1cc(Cl)ccc1OCC(=O)NC1CC1
: