Target
Urokinase-type plasminogen activator
Ligand
BDBM50068284
Substrate
Meas. Tech.
ChEMBL_212975 (CHEMBL816997)
IC50
>33000±n/a nM
Citation
 Combrink, KDGülgeze, HBMeanwell, NAPearce, BCZulan, PBisacchi, GSRoberts, DGStanley, PSeiler, SM 1,2-Benzisothiazol-3-one 1,1-dioxide inhibitors of human mast cell tryptase. J Med Chem 41:4854-60 (1998)  
Target
Name:
Urokinase-type plasminogen activator
Synonyms:
3.4.21.73 U-plasminogen activator Urokinase Urokinase-type plasminogen activator chain B Urokinase-type plasminogen activator short chain A uPA
Type:
Enzyme
Mol. Mass.:
48528.62
Organism:
Homo sapiens (Human)
Description:
P00749
Residue:
431
  
Inhibitor
Name:
BDBM50068284
Synonyms:
3-Benzyloxycarbonylamino-propionic acid 1,1,3-trioxo-1,3-dihydro-1lambda*6*-benzo[d]isothiazol-2-ylmethyl ester | CHEMBL344560
Type:
Small organic molecule
Emp. Form.:
C19H18N2O7S
Mol. Mass.:
418.42
SMILES:
O=C(CCNC(=O)OCc1ccccc1)OCN1C(=O)c2ccccc2S1(=O)=O
: