Target
Somatostatin receptor type 5
Ligand
BDBM50098603
Substrate
Meas. Tech.
ChEMBL_200858 (CHEMBL807067)
Kd
23.71±n/a nM
Citation
 Rajeswaran, WGHocart, SJMurphy, WATaylor, JECoy, DH N-Methyl scan of somatostatin octapeptide agonists produces interesting effects on receptor subtype specificity. J Med Chem 44:1416-21 (2001)  
Target
Name:
Somatostatin receptor type 5
Synonyms:
SOMATOSTATIN SST5 SS5-R SSR5_HUMAN Somatostatin receptor type 5 (SSTR5)
Type:
Enzyme
Mol. Mass.:
39218.02
Organism:
Homo sapiens (Human)
Description:
P35346
Residue:
364
  
Inhibitor
Name:
BDBM50098603
Synonyms:
10-(4-Amino-butyl)-19-[(2-amino-3-phenyl-propionyl)-methyl-amino]-16-benzyl-7-(1-hydroxy-ethyl)-13-(1H-indol-3-ylmethyl)-6,9,12,15,18-pentaoxo-1,2-dithia-5,8,11,14,17-pentaaza-cycloicosane-4-carboxylic acid (1-carbamoyl-2-hydroxy-propyl)-amide | CHEMBL405421
Type:
Small organic molecule
Emp. Form.:
C50H67N11O10S2
Mol. Mass.:
1046.265
SMILES:
C[C@@H](O)[C@H](NC(=O)[C@@H]1CSSC[C@@H](N(C)C(=O)[C@H](N)Cc2ccccc2)C(=O)N[C@@H](Cc2ccccc2)C(=O)N[C@@H](Cc2c[nH]c3ccccc23)C(=O)N[C@@H](CCCCN)C(=O)N[C@@H]([C@@H](C)O)C(=O)N1)C(N)=O
: