Target
Tubulin polymerization-promoting protein
Ligand
BDBM50099942
Substrate
Meas. Tech.
ChEMBL_925239 (CHEMBL3073731)
EC50
>100000±n/a nM
Citation
 Young, DHTice, CMMichelotti, ELRoemmele, RCSlawecki, RARubio, FMRolling, JA Structure-activity relationships of phenylcyclohexene and biphenyl antitubulin compounds against plant and mammalian cells. Bioorg Med Chem Lett 11:1393-6 (2001)  
Target
Name:
Tubulin polymerization-promoting protein
Synonyms:
25 kDa brain-specific protein TPPP_BOVIN
Type:
PROTEIN
Mol. Mass.:
23484.86
Organism:
Bos taurus
Description:
ChEMBL_106635
Residue:
218
  
Inhibitor
Name:
BDBM50099942
Synonyms:
6-(2,3,4-Trimethoxy-phenyl)-cyclohex-3-enecarbonitrile | CHEMBL417295
Type:
Small organic molecule
Emp. Form.:
C16H19NO3
Mol. Mass.:
273.327
SMILES:
COc1ccc(C2CC=CCC2C#N)c(OC)c1OC
: