Target
Alpha-1B adrenergic receptor
Ligand
BDBM50101655
Substrate
Meas. Tech.
ChEMBL_216132 (CHEMBL816952)
Ki
1.44±n/a nM
Citation
 Barlocco, DCignarella, GPiaz, VDGiovannoni, MPDe Benedetti, PGFanelli, FMontesano, FPoggesi, ELeonardi, A Phenylpiperazinylalkylamino substituted pyridazinones as potent alpha(1) adrenoceptor antagonists. J Med Chem 44:2403-10 (2001)  
Target
Name:
Alpha-1B adrenergic receptor
Synonyms:
ADA1B_HUMAN Adrenergic alpha1B Adrenergic receptor alpha Alpha 1B-adrenoreceptor | Alpha-1B adrenergic receptor
Type:
Enzyme
Mol. Mass.:
56862.13
Organism:
Homo sapiens (Human)
Description:
P35368
Residue:
520
  
Inhibitor
Name:
BDBM50101655
Synonyms:
5-Acetyl-4-{3-[4-(5-chloro-2-methoxy-phenyl)-piperazin-1-yl]-propylamino}-2-methyl-6-phenyl-2H-pyridazin-3-one | CHEMBL77618
Type:
Small organic molecule
Emp. Form.:
C27H32ClN5O3
Mol. Mass.:
510.028
SMILES:
COc1ccc(Cl)cc1N1CCN(CCCNc2c(C(C)=O)c(nn(C)c2=O)-c2ccccc2)CC1
: