Target
Adenosine receptor A1
Ligand
BDBM50112192
Substrate
Meas. Tech.
ChEMBL_29610 (CHEMBL642892)
Ki
0.84±n/a nM
Citation
 Van Calenbergh, SLink, AFujikawa, Sde Ligt, RAVanheusden, VGolisade, ABlaton, NMRozenski, JIJzerman, APHerdewijn, P 5'-Deoxy congeners of 9-(3-amido-3-deoxy-beta-D-xylofuranosyl)-N(6)-cyclopentyladenine: new adenosine A(1) receptor antagonists and inverse agonists. J Med Chem 45:1845-52 (2002)  
Target
Name:
Adenosine receptor A1
Synonyms:
AA1R_RAT ADENOSINE A1 high Adenosine A1 receptor (A1) Adenosine receptors A1 | Adora1
Type:
Protein
Mol. Mass.:
36704.13
Organism:
Rattus norvegicus (rat)
Description:
Residue:
326
  
Inhibitor
Name:
BDBM50112192
Synonyms:
1-Phenyl-cyclopentanecarboxylic acid [5-(6-cyclopentylamino-purin-9-yl)-4-hydroxy-2-methyl-tetrahydro-furan-3-yl]-amide | CHEMBL55195
Type:
Small organic molecule
Emp. Form.:
C27H34N6O3
Mol. Mass.:
490.5973
SMILES:
C[C@H]1O[C@H]([C@H](O)[C@H]1NC(=O)C1(CCCC1)c1ccccc1)n1cnc2c(NC3CCCC3)ncnc12
: