Target
5-hydroxytryptamine receptor 2A
Ligand
BDBM50113332
Substrate
Meas. Tech.
ChEMBL_2288 (CHEMBL617073)
Ki
0.3±n/a nM
Citation
 Fu, XTan, PZKula, NSBaldessarini, RTamagnan, GInnis, RBBaldwin, RM Synthesis, receptor potency, and selectivity of halogenated diphenylpiperidines as serotonin 5-HT2A ligands for PET or SPECT brain imaging. J Med Chem 45:2319-24 (2002)  
Target
Name:
5-hydroxytryptamine receptor 2A
Synonyms:
5-HT-2 5-HT2A 5-hydroxytryptamine receptor 2A (5HT-2A) 5HT2A_HUMAN HTR2A | Serotonin receptor 2A
Type:
undefined
Mol. Mass.:
52607.65
Organism:
Homo sapiens (Human)
Description:
P28223
Residue:
471
  
Inhibitor
Name:
BDBM50113332
Synonyms:
3-(2-(4-(4-fluorobenzoyl)piperidin-1-yl)ethyl)-2-thioxo-2,3-dihydroquinazolin-4(1H)-one CHEMBL62919 | altanserin
Type:
Small organic molecule
Emp. Form.:
C22H22FN3O2S
Mol. Mass.:
411.492
SMILES:
Fc1ccc(cc1)C(=O)C1CCN(CCn2c(=S)[nH]c3ccccc3c2=O)CC1
: