Target
Dihydroorotate dehydrogenase (quinone), mitochondrial
Ligand
BDBM50119487
Substrate
Meas. Tech.
ChEMBL_52885 (CHEMBL665409)
Ki
91±n/a nM
Citation
 Haque, TSTadesse, SMarcinkeviciene, JRogers, MJSizemore, CKopcho, LMAmsler, KEcret, LDZhan, DLHobbs, FSlee, ATrainor, GLStern, AMCopeland, RACombs, AP Parallel synthesis of potent, pyrazole-based inhibitors of Helicobacter pylori dihydroorotate dehydrogenase. J Med Chem 45:4669-78 (2002)  
Target
Name:
Dihydroorotate dehydrogenase (quinone), mitochondrial
Synonyms:
DHODH Dihydroorotate dehydrogenase Dihydroorotate dehydrogenase, mitochondrial Dihydroorotate oxidase (DHODH) | PYRD_HUMAN
Type:
Enzyme
Mol. Mass.:
42881.33
Organism:
Homo sapiens (Human)
Description:
Q02127
Residue:
395
  
Inhibitor
Name:
BDBM50119487
Synonyms:
1-(4-Chloro-phenyl)-1H-pyrazole-3,5-dicarboxylic acid 3-benzylamide 5-(isobutyl-amide) | CHEMBL141304
Type:
Small organic molecule
Emp. Form.:
C22H23ClN4O2
Mol. Mass.:
410.897
SMILES:
CC(C)CNC(=O)c1cc(nn1-c1ccc(Cl)cc1)C(=O)NCc1ccccc1
: