Target
Histamine H2 receptor
Ligand
BDBM50127607
Substrate
Meas. Tech.
ChEMBL_85521 (CHEMBL697132)
EC50
2500±n/a nM
Citation
 Kazuta, YHirano, KNatsume, KYamada, SKimura, RMatsumoto, SFuruichi, KMatsuda, AShuto, S Cyclopropane-based conformational restriction of histamine. (1S,2S)-2-(2-aminoethyl)-1-(1H-imidazol-4-yl)cyclopropane, a highly selective agonist for the histamine H3 receptor, having a cis-cyclopropane structure. J Med Chem 46:1980-8 (2003)  
Target
Name:
Histamine H2 receptor
Synonyms:
Gastric receptor I HISTAMINE H2 HRH2_HUMAN Histamine H2-Gs alpha S
Type:
G Protein-Coupled Receptor (GPCR)
Mol. Mass.:
40115.31
Organism:
Homo sapiens (Human)
Description:
Residue:
359
  
Inhibitor
Name:
BDBM50127607
Synonyms:
(1R,2R)-2-(1H-Imidazol-4-yl)-cyclopropylamine 2-(1H-Imidazol-4-yl)-cyclopropylamine VUF-5296
Type:
Small organic molecule
Emp. Form.:
C6H9N3
Mol. Mass.:
123.1558
SMILES:
N[C@@H]1C[C@H]1c1cnc[nH]1
: