Target
Alpha-2B adrenergic receptor
Ligand
BDBM50131356
Substrate
Meas. Tech.
ChEMBL_33356 (CHEMBL644760)
Ki
315±n/a nM
Citation
 Andrés, JIAlcázar, JAlonso, JMAlvarez, RMCid, JMDe Lucas, AIFernández, JMartínez, SNieto, CPastor, JBakker, MHBiesmans, IHeylen, LIMegens, AA Synthesis of 3a,4-dihydro-3H-[1]benzopyrano[4,3-c]isoxazoles, displaying combined 5-HT uptake inhibiting and alpha(2)-adrenoceptor antagonistic activities: a novel series of potential antidepressants. Bioorg Med Chem Lett 13:2719-25 (2003)  
Target
Name:
Alpha-2B adrenergic receptor
Synonyms:
ADA2B_HUMAN ADRA2L1 Adrenergic alpha2B Adrenergic receptor alpha Alpha-2 adrenergic receptor subtype C2 Alpha-2B adrenoreceptor | Alpha-2BAR
Type:
Enzyme
Mol. Mass.:
49964.20
Organism:
Homo sapiens (Human)
Description:
P18089
Residue:
450
  
Inhibitor
Name:
BDBM50131356
Synonyms:
3-[4-(1H-Inden-2-ylmethyl)-piperazin-1-ylmethyl]-7,8-dimethoxy-3a,4-dihydro-3H-chromeno[4,3-c]isoxazole | CHEMBL328377
Type:
Small organic molecule
Emp. Form.:
C27H31N3O4
Mol. Mass.:
461.5527
SMILES:
COc1cc2OCC3C(CN4CCN(CC5=Cc6ccccc6C5)CC4)ON=C3c2cc1OC
: