Target
Proto-oncogene tyrosine-protein kinase Src
Ligand
BDBM50451554
Substrate
Meas. Tech.
ChEBML_202616
IC50
15700±n/a nM
Citation
 Wang, YMetcalf, CAShakespeare, WCSundaramoorthi, RKeenan, TPBohacek, RSvan Schravendijk, MRViolette, SMNarula, SSDalgarno, DCHaraldson, CKeats, JLiou, SMani, UPradeepan, SRam, MAdams, SWeigele, MSawyer, TK Bone-targeted 2,6,9-trisubstituted purines: novel inhibitors of Src tyrosine kinase for the treatment of bone diseases. Bioorg Med Chem Lett 13:3067-70 (2003)  
Target
Name:
Proto-oncogene tyrosine-protein kinase Src
Synonyms:
Calmodulin/Proto-oncogene tyrosine-protein kinase Src Proto-oncogene c-Src SRC SRC_HUMAN V-src sarcoma (Schmidt-Ruppin A-2) viral oncogene homolog (avian) p60-Src | pp60c-src
Type:
Protein
Mol. Mass.:
59838.60
Organism:
Homo sapiens (Human)
Description:
P12931
Residue:
536
  
Inhibitor
Name:
BDBM50451554
Synonyms:
CHEMBL3085229
Type:
Small organic molecule
Emp. Form.:
C22H31N7O6P2
Mol. Mass.:
551.4724
SMILES:
N[C@H]1CC[C@@H](CC1)Nc1nc(Nc2ccc(c(c2)P(O)(O)=O)P(O)(O)=O)c2ncn(C3CCCC3)c2n1
: